{"text_format":"1","workbook":"xlsx","n_sheets":6,"sheets":["калькулятор","список","Лист1","форма заказа","распил","вставка"],"not_rendered":{"charts":0,"images":25,"macros":1,"external_links":0,"defined_names":50,"comments":2,"pivot_tables":0},"unopened":[],"bounds":{"document_bytes":16777216,"sheet_cells":100000,"rows_first":2000,"rows_last":500,"rows_between":2000,"halvings":0,"cell_chars":16384,"cell_head_chars":4096},"cells_cut":0,"cells_raw":0,"read":"whole","date_system":"1900"}

{"sheet":"калькулятор","index":0,"n_rows":44,"n_cols":87,"rows_kept":44,"cut":false,"hidden":false,"merged":[[10,3,10,4],[16,3,16,4],[17,3,17,4],[20,55,21,55],[20,45,21,45],[20,46,21,46],[20,47,21,47],[20,48,21,48],[20,49,21,49],[12,28,13,28],[12,29,13,29],[12,25,13,25],[12,26,13,26],[20,32,21,32],[11,21,12,21],[14,12,14,13],[20,56,21,56],[20,57,21,57],[20,50,21,50],[20,51,21,51],[20,52,21,52],[20,53,21,53],[20,54,21,54],[39,3,39,11],[4,21,7,21],[11,3,11,4],[12,3,12,4],[20,8,21,8],[20,10,21,10],[20,15,21,15],[9,3,9,4],[5,3,6,4],[15,3,15,4],[15,12,16,13],[18,12,18,13],[19,3,19,29],[9,27,10,27],[9,28,10,28],[9,29,10,29],[39,13,39,19],[15,31,16,31],[15,25,16,25],[15,26,16,26],[15,27,16,27],[15,28,16,28],[15,29,16,29],[15,30,16,30],[17,12,17,13],[20,31,21,31],[8,12,8,13],[9,25,10,25],[9,26,10,26],[6,29,7,29],[1,3,1,4],[6,25,7,25],[6,26,7,26],[3,12,3,13],[1,25,1,31],[6,27,7,27],[6,28,7,28],[3,25,4,25],[3,26,4,26],[3,27,4,27],[3,28,4,28],[3,30,4,30],[3,31,4,31],[6,31,7,31],[9,31,10,31],[12,31,13,31],[6,30,7,30],[9,30,10,30],[12,30,13,30],[12,27,13,27],[20,1,21,1],[20,27,21,27],[20,12,20,13],[20,17,21,17],[20,19,21,19],[20,21,21,21],[20,23,21,23],[20,25,21,25],[20,3,20,4],[20,6,21,6],[14,3,14,4]]}
[]
[null,null,null,"Фасад из экокожи",null,null,null,null,null,null,null,null,null,null,null,null,null,null,null,null,null,null,null,null,null,"ПАЛИТРА ЦВЕТОВ ЭКОКОЖИ"]
[]
[null,null,null,null,null,null,null,null,null,null,null,null,"Расположение присадок:",null,null,"Закладная",null,"стандартная"]
[null,null,null,null,null,null,null,null,null,null,null,null,null,null,null,"необходима ",null,"вставка",null,null,null,"укажите название цвета из палитры экокожи",null,null,null,null,null,null,null,null,null,null,null," "]
[null,null,null,"по техническим вопросам обращайтесь: +7 962 923 18 58",null,null,null,null,null,null,null,null,null,null,null,"для крепления",null,"единым"]
[null,null,null,null,null,null,null,null,null,null,null,null,null,null,null,"к фасаду",null,"полотном"]
[null,null,null,null,null,null,null,null,null,null,null,null,null,null,null,"встроенной"]
[null,null,null,"Минимальная",null,null,null,null,null,null,null,null,null,null,null,"техники,"]
[null,null,null,"высота/ширина фасада:",null,null,null,null,null,null,null,null,null,null,null,"выдвижных"]
{"$rows_left_out":35}
{"sheet":"список","index":1,"n_rows":28,"n_cols":37,"rows_kept":28,"cut":false,"hidden":true,"merged":[[18,24,18,26]]}
[null,null,null,null,null,null,null,null,null,null,null,null,null,null,null,null,null,null,null,null,null,null,null,null,"Для фильтра присадки под петли",null,null,null,null,null,null,null,null,"для фильтра вставка"]
[null,"стандартная","АРТИКУЛ","комбинированная",null,null,null,null,null,null,126.5,136,163,null,null,null,null,null,null,null,null,null,null,null,null,"Столбец1","Столбец2","Столбец3","Столбец4"]
[1,"Matti White",13037,"Matti White","M_Wh",null,"в цвет профиля",null,null,null,"прямой","скрытая","высокая",null,"прямой ",1,null,null,"черный","B",null,null,null,null,null,"прямой",null,1,"левый фасад",null,{"$f":"IF(IF(OR(калькулятор!D24>3000,калькулятор!E24>600),\"*\")=\"*\",\"7\",VLOOKUP(CONCATENATE(калькулятор!I24,\" \",калькулятор!K24),список!$O$3:$P$8,2,0))*1","v":{"$error":"#N/A"}},null,null,1,"стандартная",{"$f":"IF(OR(AND(калькулятор!D24>2650,калькулятор!E24<=850),калькулятор!D24<2650),\"1\",\"2\")*1","v":1},{"$f":"OFFSET(список!$AH$2,MATCH(список!AJ3,список!$AH$3:$AH$7,0),1,COUNTIF(список!$AH$3:$AH$7,список!AJ3),1)","v":"стандартная"}]
[2,"Matti Cream",13023,"Matti Cream","M_Cr",null,"в цвет вставки",null,null,null,null,null,"слева",null,"скрытая ",2,null,null,"серебро","S",null,null,null,null,null,"прямой",null,1,"правый фасад",null,{"$f":"IF(IF(OR(калькулятор!D25>3000,калькулятор!E25>600),\"*\")=\"*\",\"7\",VLOOKUP(CONCATENATE(калькулятор!I25,\" \",калькулятор!K25),список!$O$3:$P$8,2,0))*1","v":{"$error":"#N/A"}},null,null,1,"комбинированная",{"$f":"IF(OR(AND(калькулятор!D25>2650,калькулятор!E25<=850),калькулятор!D25<2650),\"1\",\"2\")*1","v":1},"комбинированная"]
[3,"Matti  Beige",13019,"Matti  Beige","M_Bg",null,"без прошивки",null,null,null,null,null,"справа",null,"высокая слева",3,null,null,"шампань","C",null,null,null,null,null,"прямой",null,1,"другой/без присадок",null,{"$f":"IF(IF(OR(калькулятор!D26>3000,калькулятор!E26>600),\"*\")=\"*\",\"7\",VLOOKUP(CONCATENATE(калькулятор!I26,\" \",калькулятор!K26),список!$O$3:$P$8,2,0))*1","v":{"$error":"#N/A"}},null,null,1,"без вставки",{"$f":"IF(OR(AND(калькулятор!D26>2650,калькулятор!E26<=850),калькулятор!D26<2650),\"1\",\"2\")*1","v":1},"без вставки"]
[4,"Matti M.Beige",13027,"Matti M.Beige","M_Mb",null,"другой цвет",null,null,null,null,null,"сверху",null,"высокая справа",4,null,null,"другой","х",null,null,null,null,null,"скрытая",null,2,"левый фасад",null,{"$f":"IF(IF(OR(калькулятор!D27>3000,калькулятор!E27>600),\"*\")=\"*\",\"7\",VLOOKUP(CONCATENATE(калькулятор!I27,\" \",калькулятор!K27),список!$O$3:$P$8,2,0))*1","v":{"$error":"#N/A"}},null,null,2,"комбинированная",{"$f":"IF(OR(AND(калькулятор!D27>2650,калькулятор!E27<=850),калькулятор!D27<2650),\"1\",\"2\")*1","v":1}]
[5,"Vicenza Dk.Beige",13016,"Vicenza Dk.Beige","V_Db",null,null,null,null,null,null,null,"снизу",null,"высокая сверху",5,null,null,null,null,null,null,null,null,null,"скрытая",null,2,"правый фасад",null,{"$f":"IF(IF(OR(калькулятор!D28>3000,калькулятор!E28>600),\"*\")=\"*\",\"7\",VLOOKUP(CONCATENATE(калькулятор!I28,\" \",калькулятор!K28),список!$O$3:$P$8,2,0))*1","v":{"$error":"#N/A"}},null,null,2,"без вставки",{"$f":"IF(OR(AND(калькулятор!D28>2650,калькулятор!E28<=850),калькулятор!D28<2650),\"1\",\"2\")*1","v":1}]
[6,"Vicenza Beige",13015,"Vicenza Beige","V_Bg",null,null,null,null,null,null,null,null,null,"высокая снизу",6,null,null,null,null,null,null,null,null,null,"скрытая",null,2,"другой/без присадок",null,{"$f":"IF(IF(OR(калькулятор!D29>3000,калькулятор!E29>600),\"*\")=\"*\",\"7\",VLOOKUP(CONCATENATE(калькулятор!I29,\" \",калькулятор!K29),список!$O$3:$P$8,2,0))*1","v":{"$error":"#N/A"}},null,null,null,null,{"$f":"IF(OR(AND(калькулятор!D29>2650,калькулятор!E29<=850),калькулятор!D29<2650),\"1\",\"2\")*1","v":1}]
[7,"Matti Peach",13033,"Matti Peach","M_Pe",null,null,null,null,null,null,null,null,null,null,null,null,null,null,null,null,null,null,null,null,"высокая","слева",3,"правый фасад",null,{"$f":"IF(IF(OR(калькулятор!D30>3000,калькулятор!E30>600),\"*\")=\"*\",\"7\",VLOOKUP(CONCATENATE(калькулятор!I30,\" \",калькулятор!K30),список!$O$3:$P$8,2,0))*1","v":{"$error":"#N/A"}},null,null,null,null,{"$f":"IF(OR(AND(калькулятор!D30>2650,калькулятор!E30<=850),калькулятор!D30<2650),\"1\",\"2\")*1","v":1}]
[8,"Matti Olive",13032,"Matti Olive","M_Ol",null,null,null,null,null,null,null,null,null,null,null,null,null,null,null,null,null,null,null,null,"высокая","слева",3,"другой/без присадок",null,{"$f":"IF(IF(OR(калькулятор!D31>3000,калькулятор!E31>600),\"*\")=\"*\",\"7\",VLOOKUP(CONCATENATE(калькулятор!I31,\" \",калькулятор!K31),список!$O$3:$P$8,2,0))*1","v":{"$error":"#N/A"}},null,null,null,null,{"$f":"IF(OR(AND(калькулятор!D31>2650,калькулятор!E31<=850),калькулятор!D31<2650),\"1\",\"2\")*1","v":1}]
{"$rows_left_out":19}
{"sheet":"Лист1","index":2,"n_rows":0,"n_cols":0,"rows_kept":0,"cut":false,"hidden":true,"merged":[]}

{"sheet":"форма заказа","index":3,"n_rows":38,"n_cols":23,"rows_kept":38,"cut":false,"hidden":false,"merged":[[17,13,17,19],[18,13,18,18],[18,19,19,19],[7,1,11,5],[17,1,18,12]]}
[]
[null,"№ счета в 1с:"]
[null,"Заказчик:"]
[null,"Дата составления заказа:"]
[null,"Дата согласования заказа:"]
[]
[null,"ПРИМЕЧАНИЕ К ЗАКАЗУ:"]
[]
[]
[]
{"$rows_left_out":29}
{"sheet":"распил","index":4,"n_rows":104,"n_cols":52,"rows_kept":104,"cut":false,"hidden":true,"merged":[[100,21,100,22],[101,21,101,22],[102,21,102,22],[95,21,95,22],[96,21,96,22],[97,21,97,22],[98,21,98,22],[99,21,99,22],[99,23,99,24],[100,23,100,24],[101,23,101,24],[102,23,102,24],[98,25,98,26],[99,25,99,26],[100,25,100,26],[101,25,101,26],[102,25,102,26],[2,5,6,9],[95,25,95,26],[96,25,96,26],[97,25,97,26],[98,23,98,24],[97,23,97,24],[94,25,94,26],[94,21,94,22],[92,23,93,26],[94,23,94,24],[95,23,95,24],[96,23,96,24],[92,8,93,8],[9,45,9,47],[2,2,2,3],[3,2,3,3],[4,2,4,3],[5,2,5,3],[6,2,6,3],[9,4,9,5],[9,7,9,8],[9,10,9,11],[9,19,10,19],[9,20,10,20],[8,12,9,17],[8,19,8,27],[9,21,9,26],[9,36,9,38],[9,39,9,41],[9,42,9,44],[92,19,93,19],[92,9,93,18],[92,20,92,22],[93,21,93,22],[9,27,10,27],[94,1,94,3],[96,1,96,3],[97,1,97,3],[98,1,98,3],[92,7,93,7]]}
[]
[null,null,null,null,null,"ПРИМЕЧАНИЕ К ЗАКАЗУ:"]
[null,null,"№ счета в 1с:",null,{"$f":"'форма заказа'!E2","v":0},{"$f":"'форма заказа'!B8","v":0}]
[null,null,"Заказчик:",null,{"$f":"'форма заказа'!E3","v":0}]
[null,null,"Дата составления заказа:",null,{"$f":"'форма заказа'!E4","v":"00:00:00"}]
[null,null,"Дата согласования заказа:",null,{"$f":"'форма заказа'!E5","v":"00:00:00"}]
[null,null,"Дата выполнения заказа:",null,{"$f":"E6+17","v":"1900-01-17"}]
[]
[null,null,null,null,null,null,null,null,null,null,null,null,"вставка",null,null,null,null,null,null,"присадки"]
[null,null,null,null,"вид профиля",null,null,"вид профиля",null,null,"размеры заготовок, мм",null,null,null,null,null,null,null,null,"расположение присадок (по какой стороне)","кол-во присадок, шт.","расстояние до центра чашечки петли от низа ",null,null,null,null,null,"от края до центра чашечки петли",null,null,null,null,null,null,null,null,"A (слева)",null,null,"B (сверху)",null,null,"C (справа)",null,null,"D (снизу)"]
{"$rows_left_out":95}
{"sheet":"вставка","index":5,"n_rows":48,"n_cols":48,"rows_kept":48,"cut":false,"hidden":true,"merged":[[1,2,1,3],[2,2,2,3],[3,2,3,3],[4,2,4,3],[5,2,5,3],[8,38,8,39],[8,40,8,41],[8,42,8,43],[45,1,45,2],[45,5,46,5],[8,4,8,5],[8,7,8,8],[8,10,8,11],[8,19,9,19],[8,20,9,20],[8,21,8,26],[8,27,9,27],[7,12,8,17],[2,5,6,9],[44,1,44,2],[46,1,46,2],[47,1,47,2],[8,36,8,37],[7,19,7,27]]}
[]
[null,null,"№ счета в 1с:",null,{"$f":"'форма заказа'!E2","v":0},"ПРИМЕЧАНИЕ К ЗАКАЗУ:"]
[null,null,"Заказчик:",null,{"$f":"'форма заказа'!E3","v":0},{"$f":"'форма заказа'!B8","v":0}]
[null,null,"Дата составления заказа:",null,{"$f":"'форма заказа'!E4","v":"00:00:00"}]
[null,null,"Дата согласования заказа:",null,{"$f":"'форма заказа'!E5","v":"00:00:00"}]
[null,null,"Дата выполнения заказа:",null,{"$f":"E5+20","v":"1900-01-20"}]
[]
[null,null,null,null,null,null,null,null,null,null,null,null,"вставка",null,null,null,null,null,null,"присадки"]
[null,null,null,null,"вид профиля",null,null,"вид профиля",null,null,"размеры заготовок, мм",null,null,null,null,null,null,null,null,"расположение присадок (по какой стороне)","кол-во присадок, шт.","расстояние до центра чашечки петли от низа ",null,null,null,null,null,"от края до центра чашечки петли",null,null,null,null,null,null,null,null,"A (слева)",null,"B (сверху)",null,"C (справа)",null,"D (снизу)"]
[null,null,"цвет профиля","высота фасада, мм","слева A","справа С","ширина фасада, мм","сверху B","снизу D","кол-во фасадов, шт.","высота A-C","ширина B-D","высота, мм","ширина, мм","основа","кожа лицевая сторона","прошивка (цвет нитки)","кожа оборотная сторона","закладная",null,null,"до n1","до n2","до n3","до n4","до n5","до n6",null,null,"тип профиля Laconic-S","положение \nвысокой ручки","высота \nфасада, мм","ширина \nфасада, мм","кол-во фасадов","тип фасада","закладная","тип профиля","размер","тип профиля","размер","тип профиля","размер","тип профиля","размер","высота вставки, мм","ширина вставки, мм","пвх","хдф"]
{"$rows_left_out":38}